Reaction Details
TargetMelanocortin receptor 3
LigandBDBM50017133
Substrate/Competitorn/a
Meas. Tech.ChEMBL_1365586 (CHEMBL3297367)
EC50 55±n/a nM
Citation Haslach, EMHuang, HDirain, MDebevec, GGeer, PSantos, RGGiulianotti, MAPinilla, CAppel, JRDoering, SRWalters, MAHoughten, RAHaskell-Luevano, C Identification of tetrapeptides from a mixture based positional scanning library that can restore nM full agonist function of the L106P, I69T, I102S, A219V, C271Y, and C271R human melanocortin-4 polymorphic receptors (hMC4Rs). J Med Chem57:4615-28 (2014) 
 
Melanocortin receptor 3
Name:Melanocortin receptor 3
Type:PROTEIN
Mol. Mass.:35808.24
Organism:Mus musculus
Description:ChEMBL_1498848
Residue:323
BDBM50017133
NameBDBM50017133
Synonyms:CHEMBL3287326
TypeSmall organic molecule
Emp. Form.C36H37ClN8O7
Mol. Mass.729.181
SMILESCC(=O)N[C@@H](Cc1cnc[nH]1)C(=O)N[C@H](Cc1ccc(Cl)cc1)C(=O)N1Cc2ccccc2CC1C(=O)N[C@H](Cc1ccc(cc1)[N+]([O-])=O)C(N)=O