Reaction Details
TargetMelanocortin receptor 4
LigandBDBM50017128
Substrate/Competitorn/a
Meas. Tech.ChEMBL_1365587 (CHEMBL3297368)
EC50 2.4±n/a nM
Citation Haslach, EMHuang, HDirain, MDebevec, GGeer, PSantos, RGGiulianotti, MAPinilla, CAppel, JRDoering, SRWalters, MAHoughten, RAHaskell-Luevano, C Identification of tetrapeptides from a mixture based positional scanning library that can restore nM full agonist function of the L106P, I69T, I102S, A219V, C271Y, and C271R human melanocortin-4 polymorphic receptors (hMC4Rs). J Med Chem57:4615-28 (2014) 
 
Melanocortin receptor 4
Name:Melanocortin receptor 4
Type:PROTEIN
Mol. Mass.:36964.43
Organism:Mus musculus
Description:ChEMBL_1498850
Residue:332
BDBM50017128
NameBDBM50017128
Synonyms:CHEMBL3287322
TypeSmall organic molecule
Emp. Form.C36H37IN8O7
Mol. Mass.820.6329
SMILESCC(=O)N[C@@H](Cc1cnc[nH]1)C(=O)N[C@H](Cc1ccc(I)cc1)C(=O)N1Cc2ccccc2CC1C(=O)N[C@H](Cc1ccc(cc1)[N+]([O-])=O)C(N)=O