Reaction Details
TargetMelanocortin receptor 4
LigandBDBM50017140
Substrate/Competitorn/a
Meas. Tech.ChEMBL_1365574 (CHEMBL3297283)
EC50 75±n/a nM
Citation Haslach, EMHuang, HDirain, MDebevec, GGeer, PSantos, RGGiulianotti, MAPinilla, CAppel, JRDoering, SRWalters, MAHoughten, RAHaskell-Luevano, C Identification of tetrapeptides from a mixture based positional scanning library that can restore nM full agonist function of the L106P, I69T, I102S, A219V, C271Y, and C271R human melanocortin-4 polymorphic receptors (hMC4Rs). J Med Chem57:4615-28 (2014) 
 
Melanocortin receptor 4
Name:Melanocortin receptor 4
Type:Enzyme
Mol. Mass.:36949.50
Organism:Homo sapiens (Human)
Description:P32245
Residue:332
BDBM50017140
NameBDBM50017140
Synonyms:CHEMBL3287062
TypeSmall organic molecule
Emp. Form.C31H46N14O5
Mol. Mass.694.7877
SMILESCC(=O)N[C@@H](Cc1cnc[nH]1)C(=O)N[C@@H](CCCNC(N)=N)C(=O)N[C@@H](CCCNC(N)=N)C(=O)N[C@@H](Cc1c[nH]c2ccccc12)C(N)=O