Reaction Details
TargetDelta-aminolevulinic acid dehydratase
LigandBDBM50017194
Substrate/Competitorn/a
Meas. Tech.ChEMBL_1365593 (CHEMBL3297374)
IC50 500000±n/a nM
Citation Lentz, CSHalls, VSHannam, JSStrassel, SLawrence, SHJaffe, EKFamulok, MHoerauf, APfarr, KM wALADin benzimidazoles differentially modulate the function of porphobilinogen synthase orthologs. J Med Chem57:2498-510 (2014) 
 
Delta-aminolevulinic acid dehydratase
Name:Delta-aminolevulinic acid dehydratase
Synonyms:n/a
Type:PROTEIN
Mol. Mass.:36671.06
Organism:Wolbachia sp. subsp. Brugia malayi (strain TRS)
Description:ChEMBL_108383
Residue:331
BDBM50017194
NameBDBM50017194
Synonyms:CHEMBL1774061
TypeSmall organic molecule
Emp. Form.C8H6N2O2
Mol. Mass.162.1454
SMILESOC(=O)c1ccc2[nH]cnc2c1