Reaction Details
TargetDelta-aminolevulinic acid dehydratase
LigandBDBM50017184
Substrate/Competitorn/a
Meas. Tech.ChEMBL_1365622 (CHEMBL3297469)
IC50 257000±n/a nM
Citation Lentz, CSHalls, VSHannam, JSStrassel, SLawrence, SHJaffe, EKFamulok, MHoerauf, APfarr, KM wALADin benzimidazoles differentially modulate the function of porphobilinogen synthase orthologs. J Med Chem57:2498-510 (2014) 
 
Delta-aminolevulinic acid dehydratase
Name:Delta-aminolevulinic acid dehydratase
Type:PROTEIN
Mol. Mass.:35938.25
Organism:Drosophila melanogaster
Description:ChEMBL_108389
Residue:327
BDBM50017184
NameBDBM50017184
Synonyms:CHEMBL3287360
TypeSmall organic molecule
Emp. Form.C23H18F3N3O3S
Mol. Mass.473.468
SMILESOC(=O)c1ccc2nc(CCNC(=O)c3cccs3)n(Cc3cccc(c3)C(F)(F)F)c2c1