Reaction Details
TargetDelta-aminolevulinic acid dehydratase
LigandBDBM50017192
Substrate/Competitorn/a
Meas. Tech.ChEMBL_1365622 (CHEMBL3297469)
IC50 370000±n/a nM
Citation Lentz, CSHalls, VSHannam, JSStrassel, SLawrence, SHJaffe, EKFamulok, MHoerauf, APfarr, KM wALADin benzimidazoles differentially modulate the function of porphobilinogen synthase orthologs. J Med Chem57:2498-510 (2014) 
 
Delta-aminolevulinic acid dehydratase
Name:Delta-aminolevulinic acid dehydratase
Type:PROTEIN
Mol. Mass.:35938.25
Organism:Drosophila melanogaster
Description:ChEMBL_108389
Residue:327
BDBM50017192
NameBDBM50017192
Synonyms:CHEMBL3287368
TypeSmall organic molecule
Emp. Form.C16H14N2O3
Mol. Mass.282.294
SMILESCOc1cccc(Cn2cnc3cc(ccc23)C(O)=O)c1