Reaction Details
TargetDelta-aminolevulinic acid dehydratase
LigandBDBM50017193
Substrate/Competitorn/a
Meas. Tech.ChEMBL_1365622 (CHEMBL3297469)
IC50>1000000±n/a nM
Citation Lentz, CSHalls, VSHannam, JSStrassel, SLawrence, SHJaffe, EKFamulok, MHoerauf, APfarr, KM wALADin benzimidazoles differentially modulate the function of porphobilinogen synthase orthologs. J Med Chem57:2498-510 (2014) 
 
Delta-aminolevulinic acid dehydratase
Name:Delta-aminolevulinic acid dehydratase
Type:PROTEIN
Mol. Mass.:35938.25
Organism:Drosophila melanogaster
Description:ChEMBL_108389
Residue:327
BDBM50017193
NameBDBM50017193
Synonyms:CHEMBL3287369
TypeSmall organic molecule
Emp. Form.C9H8N2O2
Mol. Mass.176.172
SMILESCn1cnc2cc(ccc12)C(O)=O