Reaction Details
TargetDelta-aminolevulinic acid dehydratase
LigandBDBM50017183
Substrate/Competitorn/a
Meas. Tech.ChEMBL_1365972 (CHEMBL3296703)
IC50 94000±n/a nM
Citation Lentz, CSHalls, VSHannam, JSStrassel, SLawrence, SHJaffe, EKFamulok, MHoerauf, APfarr, KM wALADin benzimidazoles differentially modulate the function of porphobilinogen synthase orthologs. J Med Chem57:2498-510 (2014) 
 
Delta-aminolevulinic acid dehydratase
Name:Delta-aminolevulinic acid dehydratase
Type:PROTEIN
Mol. Mass.:37028.00
Organism:Pseudomonas aeruginosa (strain ATCC 15692 / PAO1 / 1C / PRS 101 / LMG12228)
Description:ChEMBL_108388
Residue:337
BDBM50017183
NameBDBM50017183
Synonyms:CHEMBL3287359
TypeSmall organic molecule
Emp. Form.C16H11F3N2O2
Mol. Mass.320.2659
SMILESOC(=O)c1ccc2n(Cc3cccc(c3)C(F)(F)F)cnc2c1