Reaction Details
TargetDelta-aminolevulinic acid dehydratase
LigandBDBM50017195
Substrate/Competitorn/a
Meas. Tech.ChEMBL_1365972 (CHEMBL3296703)
IC50 475000±n/a nM
Citation Lentz, CSHalls, VSHannam, JSStrassel, SLawrence, SHJaffe, EKFamulok, MHoerauf, APfarr, KM wALADin benzimidazoles differentially modulate the function of porphobilinogen synthase orthologs. J Med Chem57:2498-510 (2014) 
 
Delta-aminolevulinic acid dehydratase
Name:Delta-aminolevulinic acid dehydratase
Type:PROTEIN
Mol. Mass.:37028.00
Organism:Pseudomonas aeruginosa (strain ATCC 15692 / PAO1 / 1C / PRS 101 / LMG12228)
Description:ChEMBL_108388
Residue:337
BDBM50017195
NameBDBM50017195
Synonyms:CHEMBL2430557
TypeSmall organic molecule
Emp. Form.C21H15F3N2O3
Mol. Mass.400.3506
SMILESOC(=O)c1c2CN(CCc2nc2ccccc12)C(=O)c1cccc(c1)C(F)(F)F