Reaction Details
TargetDelta-aminolevulinic acid dehydratase, chloroplastic
LigandBDBM50017190
Substrate/Competitorn/a
Meas. Tech.ChEMBL_1365592 (CHEMBL3297373)
IC50 182000±n/a nM
Citation Lentz, CSHalls, VSHannam, JSStrassel, SLawrence, SHJaffe, EKFamulok, MHoerauf, APfarr, KM wALADin benzimidazoles differentially modulate the function of porphobilinogen synthase orthologs. J Med Chem57:2498-510 (2014) 
 
Delta-aminolevulinic acid dehydratase, chloroplastic
Name:Delta-aminolevulinic acid dehydratase, chloroplastic
Type:PROTEIN
Mol. Mass.:43811.42
Organism:Pisum sativum
Description:ChEMBL_108384
Residue:398
BDBM50017190
NameBDBM50017190
Synonyms:CHEMBL3287366
TypeSmall organic molecule
Emp. Form.C15H12N2O2
Mol. Mass.252.268
SMILESOC(=O)c1ccc2n(Cc3ccccc3)cnc2c1