Reaction Details
TargetDelta-aminolevulinic acid dehydratase, chloroplastic
LigandBDBM50017191
Substrate/Competitorn/a
Meas. Tech.ChEMBL_1365592 (CHEMBL3297373)
IC50 95900±n/a nM
Citation Lentz, CSHalls, VSHannam, JSStrassel, SLawrence, SHJaffe, EKFamulok, MHoerauf, APfarr, KM wALADin benzimidazoles differentially modulate the function of porphobilinogen synthase orthologs. J Med Chem57:2498-510 (2014) 
 
Delta-aminolevulinic acid dehydratase, chloroplastic
Name:Delta-aminolevulinic acid dehydratase, chloroplastic
Type:PROTEIN
Mol. Mass.:43811.42
Organism:Pisum sativum
Description:ChEMBL_108384
Residue:398
BDBM50017191
NameBDBM50017191
Synonyms:CHEMBL3287367
TypeSmall organic molecule
Emp. Form.C16H14N2O2
Mol. Mass.266.2946
SMILESCc1cccc(Cn2cnc3cc(ccc23)C(O)=O)c1