Reaction Details
TargetMetabotropic glutamate receptor 2
LigandBDBM50017211
Substrate/Competitorn/a
Meas. Tech.ChEMBL_1362011 (CHEMBL3294082)
EC50 12±n/a nM
Citation Dhanya, RPSheffler, DJDahl, RDavis, MLee, PSYang, LNickols, HHCho, HPSmith, LHD'Souza, MSConn, PJDer-Avakian, AMarkou, ACosford, ND Design and synthesis of systemically active metabotropic glutamate subtype-2 and -3 (mGlu2/3) receptor positive allosteric modulators (PAMs): pharmacological characterization and assessment in a rat model of cocaine dependence. J Med Chem57:4154-72 (2014) 
 
Metabotropic glutamate receptor 2
Name:Metabotropic glutamate receptor 2
Type:Enzyme
Mol. Mass.:95584.88
Organism:Homo sapiens (Human)
Description:Q14416
Residue:872
BDBM50017211
NameBDBM50017211
Synonyms:CHEMBL3287695 | US10099993, Compound 44
TypeSmall organic molecule
Emp. Form.C24H30O7
Mol. Mass.430.4908
SMILESCOc1cc(ccc1OCCCCOc1ccc(C(=O)CC(C)C)c(O)c1C)C(O)=O