Reaction Details
TargetMetabotropic glutamate receptor 4
LigandBDBM50017264
Substrate/Competitorn/a
Meas. Tech.ChEMBL_1362022 (CHEMBL3294093)
IC50>10000±n/a nM
Citation Dhanya, RPSheffler, DJDahl, RDavis, MLee, PSYang, LNickols, HHCho, HPSmith, LHD'Souza, MSConn, PJDer-Avakian, AMarkou, ACosford, ND Design and synthesis of systemically active metabotropic glutamate subtype-2 and -3 (mGlu2/3) receptor positive allosteric modulators (PAMs): pharmacological characterization and assessment in a rat model of cocaine dependence. J Med Chem57:4154-72 (2014) 
 
Metabotropic glutamate receptor 4
Name:Metabotropic glutamate receptor 4
Type:Enzyme
Mol. Mass.:101849.79
Organism:Rattus norvegicus (Rat)
Description:P31423
Residue:912
BDBM50017264
NameBDBM50017264
Synonyms:CHEMBL3287718
TypeSmall organic molecule
Emp. Form.C23H28O7
Mol. Mass.416.4642
SMILESCCCC(=O)c1ccc(OCCCCOc2c(OC)cccc2C(O)=O)c(C)c1O