Reaction Details
TargetMetabotropic glutamate receptor 2
LigandBDBM50017254
Substrate/Competitorn/a
Meas. Tech.ChEMBL_1361352 (CHEMBL3293516)
EC50 228±n/a nM
Citation Dhanya, RPSheffler, DJDahl, RDavis, MLee, PSYang, LNickols, HHCho, HPSmith, LHD'Souza, MSConn, PJDer-Avakian, AMarkou, ACosford, ND Design and synthesis of systemically active metabotropic glutamate subtype-2 and -3 (mGlu2/3) receptor positive allosteric modulators (PAMs): pharmacological characterization and assessment in a rat model of cocaine dependence. J Med Chem57:4154-72 (2014) 
 
Metabotropic glutamate receptor 2
Name:Metabotropic glutamate receptor 2
Type:Enzyme
Mol. Mass.:95584.88
Organism:Homo sapiens (Human)
Description:Q14416
Residue:872
BDBM50017254
NameBDBM50017254
Synonyms:CHEMBL3287696
TypeSmall organic molecule
Emp. Form.C26H32O7
Mol. Mass.456.5281
SMILESCc1c(O)c(ccc1OCCCCOCOc1ccc(cc1)C(O)=O)C(=O)CC1CCCC1