Reaction Details
TargetCytochrome P450 2C9
LigandBDBM50017298
Substrate/Competitorn/a
Meas. Tech.ChEMBL_1362434 (CHEMBL3292790)
IC50<1000±n/a nM
Citation De Savi, CCox, RJWarner, DJCook, ARDickinson, MRMcDonough, AMorrill, LCParker, BAndrews, GYoung, SSGilmour, PSRiley, RDearman, MS Efficacious inhaled PDE4 inhibitors with low emetic potential and long duration of action for the treatment of COPD. J Med Chem57:4661-76 (2014) 
 
Cytochrome P450 2C9
Name:Cytochrome P450 2C9
Type:Enzyme
Mol. Mass.:55636.33
Organism:Homo sapiens (Human)
Description:P11712
Residue:490
BDBM50017298
NameBDBM50017298
Synonyms:CHEMBL3288010
TypeSmall organic molecule
Emp. Form.C39H42FN7O3
Mol. Mass.675.7943
SMILESC[C@H]1CN(Cc2ccc(cc2)-c2cccc(Oc3ncc(F)cc3C(=O)N[C@@H]3CC[C@@H](CC3)NC(=O)c3cc4ccccn4n3)c2)C[C@@H](C)N1