Reaction Details
TargetCytochrome P450 1A2
LigandBDBM50017297
Substrate/Competitorn/a
Meas. Tech.ChEMBL_1362438 (CHEMBL3292794)
IC50<1000±n/a nM
Citation De Savi, CCox, RJWarner, DJCook, ARDickinson, MRMcDonough, AMorrill, LCParker, BAndrews, GYoung, SSGilmour, PSRiley, RDearman, MS Efficacious inhaled PDE4 inhibitors with low emetic potential and long duration of action for the treatment of COPD. J Med Chem57:4661-76 (2014) 
 
Cytochrome P450 1A2
Name:Cytochrome P450 1A2
Type:Enzyme
Mol. Mass.:58423.38
Organism:Homo sapiens (Human)
Description:P05177
Residue:516
BDBM50017297
NameBDBM50017297
Synonyms:CHEMBL3288009
TypeSmall organic molecule
Emp. Form.C43H48FN7O3
Mol. Mass.729.8847
SMILESCc1cccc2nc(cn12)C(=O)N[C@H]1CC[C@H](CC1)NC(=O)c1cc(F)cnc1Oc1cccc(c1)-c1ccc(CN2CCC(CC2)N2CCCC2)cc1