Reaction Details
TargetcAMP-specific 3',5'-cyclic phosphodiesterase 4B
LigandBDBM50017332
Substrate/Competitorn/a
Meas. Tech.ChEMBL_1362418 (CHEMBL3292526)
IC50 0.125893±n/a nM
Citation De Savi, CCox, RJWarner, DJCook, ARDickinson, MRMcDonough, AMorrill, LCParker, BAndrews, GYoung, SSGilmour, PSRiley, RDearman, MS Efficacious inhaled PDE4 inhibitors with low emetic potential and long duration of action for the treatment of COPD. J Med Chem57:4661-76 (2014) 
 
cAMP-specific 3',5'-cyclic phosphodiesterase 4B
Name:cAMP-specific 3',5'-cyclic phosphodiesterase 4B
Type:Protein
Mol. Mass.:83318.87
Organism:Homo sapiens (Human)
Description:Q07343
Residue:736
BDBM50017332
NameBDBM50017332
Synonyms:CHEMBL3288021
TypeSmall organic molecule
Emp. Form.C37H41FN6O4
Mol. Mass.652.7576
SMILESC[C@H]1CN(Cc2ccc(cc2)-c2cccc(Oc3ncc(F)cc3C(=O)N[C@H]3CC[C@H](CC3)NC(=O)c3ncccc3O)c2)C[C@@H](C)N1