Reaction Details
TargetCytochrome P450 2C19
LigandBDBM50017338
Substrate/Competitorn/a
Meas. Tech.ChEMBL_1362773 (CHEMBL3295216)
IC50<1000±n/a nM
Citation De Savi, CCox, RJWarner, DJCook, ARDickinson, MRMcDonough, AMorrill, LCParker, BAndrews, GYoung, SSGilmour, PSRiley, RDearman, MS Efficacious inhaled PDE4 inhibitors with low emetic potential and long duration of action for the treatment of COPD. J Med Chem57:4661-76 (2014) 
 
Cytochrome P450 2C19
Name:Cytochrome P450 2C19
Type:Enzyme
Mol. Mass.:55935.47
Organism:Homo sapiens (Human)
Description:P33261
Residue:490
BDBM50017338
NameBDBM50017338
Synonyms:CHEMBL3288027
TypeSmall organic molecule
Emp. Form.C39H48FN7O3
Mol. Mass.681.8419
SMILESC[C@H]1CN(CCCc2ccc(cc2)-c2cccc(Oc3ncc(F)cc3C(=O)N[C@@H]3CC[C@@H](CC3)NC(=O)c3cc(C)n(C)n3)c2)C[C@@H](C)N1