Reaction Details
TargetSecreted frizzled-related protein 1
LigandBDBM50017347
Substrate/Competitorn/a
Meas. Tech.ChEMBL_1363191 (CHEMBL3293906)
Kd 9000±n/a nM
Citation Roy, SEl Hadri, ARichard, SDenis, FHolte, KDuffner, JYu, FGalcheva-Gargova, ZCapila, ISchultes, BPetitou, MKaundinya, GV Synthesis and biological evaluation of a unique heparin mimetic hexasaccharide for structure-activity relationship studies. J Med Chem57:4511-20 (2014) 
 
Secreted frizzled-related protein 1
Name:Secreted frizzled-related protein 1
Type:PROTEIN
Mol. Mass.:35404.91
Organism:Homo sapiens (Human)
Description:ChEMBL_1363191
Residue:314
BDBM50017347
NameBDBM50017347
Synonyms:CHEMBL3288259
TypeSmall organic molecule
Emp. Form.C41H61N4Na9O49S6
Mol. Mass.1793.218
SMILES[Na+].[Na+].[Na+].[Na+].[Na+].[Na+].[Na+].[Na+].[Na+].[H][C@]1(O[C@@H]2O[C@H]([C@@H](O)[C@H](O)[C@H]2OS([O-])(=O)=O)C([O-])=O)[C@H](O)[C@@H](NS([O-])(=O)=O)[C@@H](O[C@@]2([H])[C@H](O)[C@@H](OS([O-])(=O)=O)[C@H](O[C@@]3([H])[C@H](O)[C@@H](NS([O-])(=O)=O)[C@@H](O[C@@]4([H])[C@H](O)[C@@H](OS([O-])(=O)=O)[C@H](O[C@@]5([H])[C@H](O)[C@@H](NS([O-])(=O)=O)[C@@H](OCCCCCN)O[C@@H]5CO)O[C@H]4C([O-])=O)O[C@@H]3CO)O[C@H]2C([O-])=O)O[C@@H]1CO