Reaction Details
TargetStromal cell-derived factor 1
LigandBDBM50017345
Substrate/Competitorn/a
Meas. Tech.ChEMBL_1363183 (CHEMBL3293898)
Kd 24000±n/a nM
Citation Roy, SEl Hadri, ARichard, SDenis, FHolte, KDuffner, JYu, FGalcheva-Gargova, ZCapila, ISchultes, BPetitou, MKaundinya, GV Synthesis and biological evaluation of a unique heparin mimetic hexasaccharide for structure-activity relationship studies. J Med Chem57:4511-20 (2014) 
 
Stromal cell-derived factor 1
Name:Stromal cell-derived factor 1
Type:Enzyme
Mol. Mass.:10677.83
Organism:Homo sapiens (Human)
Description:P48061
Residue:93
BDBM50017345
NameBDBM50017345
Synonyms:CHEMBL3288260
TypeSmall organic molecule
Emp. Form.C45H64N3Na9O51S6
Mol. Mass.1862.277
SMILES[Na+].[Na+].[Na+].[Na+].[Na+].[Na+].[Na+].[Na+].[Na+].[H][C@]1(O[C@@H]2O[C@@H](C([O-])=O)[C@@]([H])(O[C@H]3O[C@H](COS([O-])(=O)=O)[C@@]([H])(O[C@@H]4O[C@@H](C([O-])=O)[C@@]([H])(O[C@H]5O[C@H](COS([O-])(=O)=O)[C@@]([H])(O[C@@H]6O[C@H]([C@@H](O)[C@H](O)[C@H]6OS([O-])(=O)=O)C([O-])=O)[C@H](O)[C@H]5NC(C)=O)[C@H](O)[C@H]4OS([O-])(=O)=O)[C@H](O)[C@H]3NS([O-])(=O)=O)[C@H](O)[C@H]2O)[C@H](O)[C@@H](NC(C)=O)[C@@H](OCCCCC)O[C@@H]1COS([O-])(=O)=O