Reaction Details
TargetIntegrase
LigandBDBM50017357
Substrate/Competitorn/a
Meas. Tech.ChEMBL_1363202 (CHEMBL3294150)
IC50 60±n/a nM
Citation Suchaud, VBailly, FLion, CCalmels, CAndréola, MLChrist, FDebyser, ZCotelle, P Investigation of a novel series of 2-hydroxyisoquinoline-1,3(2H,4H)-diones as human immunodeficiency virus type 1 integrase inhibitors. J Med Chem57:4640-60 (2014) 
 
Integrase
Name:Integrase
Synonyms:Human immunodeficiency virus type 1 integrase
Type:PROTEIN
Mol. Mass.:32231.48
Organism:Human immunodeficiency virus 1
Description:ChEMBL_90865
Residue:288
BDBM50017357
NameBDBM50017357
Synonyms:CHEMBL3288264
TypeSmall organic molecule
Emp. Form.C16H19N3O6
Mol. Mass.349.3386
SMILESCCCCCCNC(=O)c1c(O)n(O)c(=O)c2cc(ccc12)[N+]([O-])=O