Reaction Details
TargetIntegrase
LigandBDBM50017362
Substrate/Competitorn/a
Meas. Tech.ChEMBL_1363202 (CHEMBL3294150)
IC50 10.0±n/a nM
Citation Suchaud, VBailly, FLion, CCalmels, CAndréola, MLChrist, FDebyser, ZCotelle, P Investigation of a novel series of 2-hydroxyisoquinoline-1,3(2H,4H)-diones as human immunodeficiency virus type 1 integrase inhibitors. J Med Chem57:4640-60 (2014) 
 
Integrase
Name:Integrase
Synonyms:Human immunodeficiency virus type 1 integrase
Type:PROTEIN
Mol. Mass.:32231.48
Organism:Human immunodeficiency virus 1
Description:ChEMBL_90865
Residue:288
BDBM50017362
NameBDBM50017362
Synonyms:CHEMBL3288268
TypeSmall organic molecule
Emp. Form.C18H15N3O7
Mol. Mass.385.3276
SMILESCOc1ccc(CNC(=O)c2c(O)n(O)c(=O)c3cc(ccc23)[N+]([O-])=O)cc1