Reaction Details
TargetIntegrase
LigandBDBM50017366
Substrate/Competitorn/a
Meas. Tech.ChEMBL_1363202 (CHEMBL3294150)
IC50 110±n/a nM
Citation Suchaud, VBailly, FLion, CCalmels, CAndréola, MLChrist, FDebyser, ZCotelle, P Investigation of a novel series of 2-hydroxyisoquinoline-1,3(2H,4H)-diones as human immunodeficiency virus type 1 integrase inhibitors. J Med Chem57:4640-60 (2014) 
 
Integrase
Name:Integrase
Synonyms:Human immunodeficiency virus type 1 integrase
Type:PROTEIN
Mol. Mass.:32231.48
Organism:Human immunodeficiency virus 1
Description:ChEMBL_90865
Residue:288
BDBM50017366
NameBDBM50017366
Synonyms:CHEMBL3288275
TypeSmall organic molecule
Emp. Form.C17H14FN3O4
Mol. Mass.343.3092
SMILESNc1ccc2C(C(=O)NCc3ccc(F)cc3)C(=O)N(O)C(=O)c2c1