Reaction Details
TargetIntegrase
LigandBDBM50017368
Substrate/Competitorn/a
Meas. Tech.ChEMBL_1363202 (CHEMBL3294150)
IC50 240±n/a nM
Citation Suchaud, VBailly, FLion, CCalmels, CAndréola, MLChrist, FDebyser, ZCotelle, P Investigation of a novel series of 2-hydroxyisoquinoline-1,3(2H,4H)-diones as human immunodeficiency virus type 1 integrase inhibitors. J Med Chem57:4640-60 (2014) 
 
Integrase
Name:Integrase
Synonyms:Human immunodeficiency virus type 1 integrase
Type:PROTEIN
Mol. Mass.:32231.48
Organism:Human immunodeficiency virus 1
Description:ChEMBL_90865
Residue:288
BDBM50017368
NameBDBM50017368
Synonyms:CHEMBL3288277
TypeSmall organic molecule
Emp. Form.C17H12F2N2O4
Mol. Mass.346.285
SMILESON1C(=O)C(C(=O)NCc2ccc(F)cc2)c2cc(F)ccc2C1=O