Reaction Details
TargetTransient receptor potential cation channel subfamily V member 1
LigandBDBM50017581
Substrate/Competitorn/a
Meas. Tech.ChEMBL_1363991 (CHEMBL3295578)
Ki 6.8±n/a nM
Citation Kim, HSJin, MKKang, SULim, JOTran, PTHoang, VHAnn, JHa, THPearce, LVPavlyukovets, VABlumberg, PMLee, J a-Methylated simplified resiniferatoxin (sRTX) thiourea analogues as potent and stereospecific TRPV1 antagonists. Bioorg Med Chem Lett24:2685-8 (2014) 
 
Transient receptor potential cation channel subfamily V member 1
Name:Transient receptor potential cation channel subfamily V member 1
Type:Transient Receptor
Mol. Mass.:94956.12
Organism:Rattus norvegicus (rat)
Description:O35433
Residue:838
BDBM50017581
NameBDBM50017581
Synonyms:CHEMBL3288631
TypeSmall organic molecule
Emp. Form.C29H43N3O4S2
Mol. Mass.561.799
SMILESC[C@@H](NC(=S)NC[C@@H](COC(=O)C(C)(C)C)Cc1ccc(cc1)C(C)(C)C)c1ccc(NS(C)(=O)=O)cc1