Reaction Details
TargetTransient receptor potential cation channel subfamily V member 1
LigandBDBM50017593
Substrate/Competitorn/a
Meas. Tech.ChEMBL_1363992 (CHEMBL3295579)
Ki 7.1±n/a nM
Citation Kim, HSJin, MKKang, SULim, JOTran, PTHoang, VHAnn, JHa, THPearce, LVPavlyukovets, VABlumberg, PMLee, J a-Methylated simplified resiniferatoxin (sRTX) thiourea analogues as potent and stereospecific TRPV1 antagonists. Bioorg Med Chem Lett24:2685-8 (2014) 
 
Transient receptor potential cation channel subfamily V member 1
Name:Transient receptor potential cation channel subfamily V member 1
Type:Transient Receptor
Mol. Mass.:94956.12
Organism:Rattus norvegicus (rat)
Description:O35433
Residue:838
BDBM50017593
NameBDBM50017593
Synonyms:CHEMBL3288625
TypeSmall organic molecule
Emp. Form.C27H39N3O4S2
Mol. Mass.533.746
SMILESC[C@@H](NC(=S)NC[C@H](COC(=O)C(C)(C)C)Cc1ccc(C)c(C)c1)c1ccc(NS(C)(=O)=O)cc1