Reaction Details
TargetRAS guanyl-releasing protein 1
LigandBDBM50017889
Substrate/Competitorn/a
Meas. Tech.ChEMBL_1364410 (CHEMBL3294522)
Ki 1.6±n/a nM
Citation Garcia, LCDonadío, LGMann, EKolusheva, SKedei, NLewin, NEHill, CSKelsey, JSYang, JEsch, TESantos, MPeach, MLKelley, JABlumberg, PMJelinek, RMarquez, VEComin, MJ Synthesis, biological, and biophysical studies of DAG-indololactones designed as selective activators of RasGRP. Bioorg Med Chem22:3123-40 (2014) 
 
RAS guanyl-releasing protein 1
Name:RAS guanyl-releasing protein 1
Type:PROTEIN
Mol. Mass.:90418.98
Organism:Homo sapiens (Human)
Description:ChEMBL_102739
Residue:797
BDBM50017889
NameBDBM50017889
Synonyms:CHEMBL3289011
TypeSmall organic molecule
Emp. Form.C24H31NO5
Mol. Mass.413.5066
SMILESCCCC(CCC)C(=O)OCC1(CO)C\C(=C/c2cccc3n(C)ccc23)C(=O)O1