Reaction Details
TargetSuppressor of tumorigenicity 14 protein
LigandBDBM50017894
Substrate/Competitorn/a
Meas. Tech.ChEMBL_1364433 (CHEMBL3294545)
Ki 2032±n/a nM
Citation Goswami, RMukherjee, SGhadiyaram, CWohlfahrt, GSistla, RKNagaraj, JSatyam, LKSubbarao, KPalakurthy, RKGopinath, SKrishnamurthy, NRIkonen, TMoilanen, ASubramanya, HSKallio, PRamachandra, M Structure-guided discovery of 1,3,5 tri-substituted benzenes as potent and selective matriptase inhibitors exhibiting in vivo antitumor efficacy. Bioorg Med Chem22:3187-203 (2014) 
 
Suppressor of tumorigenicity 14 protein
Name:Suppressor of tumorigenicity 14 protein
Type:Single-pass type II membrane protein
Mol. Mass.:94769.23
Organism:Homo sapiens (Human)
Description:Q9Y5Y6
Residue:855
BDBM50017894
NameBDBM50017894
Synonyms:CHEMBL3289040
TypeSmall organic molecule
Emp. Form.C25H28N6O3
Mol. Mass.460.5282
SMILESN[C@H]1CC[C@@H](CC1)NC(=O)c1cc(Oc2ccc(cc2)C(N)=N)cc(Oc2ccc(N)nc2)c1