Reaction Details
TargetCoagulation factor X
LigandBDBM50017911
Substrate/Competitorn/a
Meas. Tech.ChEMBL_1364435 (CHEMBL3294776)
Ki 62±n/a nM
Citation Goswami, RMukherjee, SGhadiyaram, CWohlfahrt, GSistla, RKNagaraj, JSatyam, LKSubbarao, KPalakurthy, RKGopinath, SKrishnamurthy, NRIkonen, TMoilanen, ASubramanya, HSKallio, PRamachandra, M Structure-guided discovery of 1,3,5 tri-substituted benzenes as potent and selective matriptase inhibitors exhibiting in vivo antitumor efficacy. Bioorg Med Chem22:3187-203 (2014) 
 
Coagulation factor X
Name:Coagulation factor X
Type:PROTEIN
Mol. Mass.:54498.45
Organism:Bos taurus
Description:ChEMBL_1364435
Residue:492
BDBM50017911
NameBDBM50017911
Synonyms:CHEMBL3289033
TypeSmall organic molecule
Emp. Form.C28H33N7O3
Mol. Mass.515.6067
SMILESNCCN1CCC(CC1)C(=O)Nc1cc(Oc2ccc(cc2)C(N)=N)cc(Oc2ccc(cc2)C(N)=N)c1