Reaction Details
TargetCoagulation factor X
LigandBDBM50017939
Substrate/Competitorn/a
Meas. Tech.ChEMBL_1364435 (CHEMBL3294776)
Ki 336±n/a nM
Citation Goswami, RMukherjee, SGhadiyaram, CWohlfahrt, GSistla, RKNagaraj, JSatyam, LKSubbarao, KPalakurthy, RKGopinath, SKrishnamurthy, NRIkonen, TMoilanen, ASubramanya, HSKallio, PRamachandra, M Structure-guided discovery of 1,3,5 tri-substituted benzenes as potent and selective matriptase inhibitors exhibiting in vivo antitumor efficacy. Bioorg Med Chem22:3187-203 (2014) 
 
Coagulation factor X
Name:Coagulation factor X
Type:PROTEIN
Mol. Mass.:54498.45
Organism:Bos taurus
Description:ChEMBL_1364435
Residue:492
BDBM50017939
NameBDBM50017939
Synonyms:CHEMBL3289028
TypeSmall organic molecule
Emp. Form.C30H33N5O3
Mol. Mass.511.6147
SMILESNC(=N)c1ccc(Oc2cc(Oc3ccc(cc3)C(N)=N)cc(c2)C(=O)N2CCC3CCCCC3C2)cc1