Reaction Details
TargetD(4) dopamine receptor
LigandBDBM50384954
Substrate/Competitorn/a
Meas. Tech.ChEMBL_1365238 (CHEMBL3292988)
Ki 0.840000±n/a nM
Citation Sampson, DZhu, XYEyunni, SVEtukala, JROfori, EBricker, BLamango, NSSetola, VRoth, BLAblordeppey, SY Identification of a new selective dopamine D4 receptor ligand. Bioorg Med Chem22:3105-14 (2014) 
 
D(4) dopamine receptor
Name:D(4) dopamine receptor
Type:Enzyme Catalytic Domain
Mol. Mass.:41307.65
Organism:RAT
Description:DOPAMINE D4.4 0 RAT::P30729
Residue:387
BDBM50384954
NameBDBM50384954
Synonyms:CHEMBL2037521
TypeSmall organic molecule
Emp. Form.C19H23N5S
Mol. Mass.353.484
SMILESC(CCc1nc2ccccc2s1)CN1CCN(CC1)c1ncccn1