Reaction Details
TargetRetinoic acid receptor RXR-alpha
LigandBDBM31892
Substrate/Competitorn/a
Meas. Tech.ChEMBL_1365631 (CHEMBL3297478)
EC50 110±n/a nM
Citation Atigadda, VRXia, GDesphande, ABoerma, LJLobo-Ruppert, SGrubbs, CJSmith, CDBrouillette, WJMuccio, DD Methyl substitution of a rexinoid agonist improves potency and reveals site of lipid toxicity. J Med Chem57:5370-80 (2014) 
 
Retinoic acid receptor RXR-alpha
Name:Retinoic acid receptor RXR-alpha
Type:Enzyme Catalytic Domain
Mol. Mass.:51273.78
Organism:RAT
Description:NR2B Channel Blocker 0 RAT::Q05343
Residue:467
BDBM31892
NameBDBM31892
Synonyms:9-cis retinoic acid CHEMBL705 alitretinoin
TypeSmall organic molecule
Emp. Form.C20H28O2
Mol. Mass.300.4351
SMILESC\C(\C=C\C1=C(C)CCCC1(C)C)=C\C=C\C(\C)=C\C(O)=O