Reaction Details
TargetRetinoic acid receptor RXR-alpha
LigandBDBM31892
Substrate/Competitorn/a
Meas. Tech.ChEMBL_1365628 (CHEMBL3297475)
EC50 120±n/a nM
Citation Atigadda, VRXia, GDesphande, ABoerma, LJLobo-Ruppert, SGrubbs, CJSmith, CDBrouillette, WJMuccio, DD Methyl substitution of a rexinoid agonist improves potency and reveals site of lipid toxicity. J Med Chem57:5370-80 (2014) 
 
Retinoic acid receptor RXR-alpha
Name:Retinoic acid receptor RXR-alpha
Type:PROTEIN
Mol. Mass.:50820.38
Organism:Homo sapiens (Human)
Description:ChEMBL_1456363
Residue:462
BDBM31892
NameBDBM31892
Synonyms:9-cis retinoic acid CHEMBL705 alitretinoin
TypeSmall organic molecule
Emp. Form.C20H28O2
Mol. Mass.300.4351
SMILESC\C(\C=C\C1=C(C)CCCC1(C)C)=C\C=C\C(\C)=C\C(O)=O