Reaction Details
TargetDihydroorotate dehydrogenase (quinone), mitochondrial
LigandBDBM50018008
Substrate/Competitorn/a
Meas. Tech.ChEMBL_1366448 (CHEMBL3296348)
IC50 130±n/a nM
Citation Deng, XKokkonda, SEl Mazouni, FWhite, JBurrows, JNKaminsky, WCharman, SAMatthews, DRathod, PKPhillips, MA Fluorine modulates species selectivity in the triazolopyrimidine class of Plasmodium falciparum dihydroorotate dehydrogenase inhibitors. J Med Chem57:5381-94 (2014) 
 
Dihydroorotate dehydrogenase (quinone), mitochondrial
Name:Dihydroorotate dehydrogenase (quinone), mitochondrial
Type:Enzyme
Mol. Mass.:42672.97
Organism:Rattus norvegicus (rat)
Description:The enzyme assay was performed with the histidine-tagged enzyme without cleavage of the tag.
Residue:395
BDBM50018008
NameBDBM50018008
Synonyms:CHEMBL3289671 | US9238653, Table 5, Compound 43
TypeSmall organic molecule
Emp. Form.C15H10F7N5
Mol. Mass.393.2622
SMILESCc1cc(Nc2cc(F)c(c(F)c2)C(F)(F)F)n2nc(nc2n1)C(C)(F)F