Reaction Details
TargetD(2) dopamine receptor
LigandBDBM50008735
Substrate/Competitorn/a
Meas. Tech.ChEMBL_1361032 (CHEMBL3295410)
IC50 5.0±n/a nM
Citation Kolaczkowski, MMarcinkowska, MBucki, APawlowski, MMitka, KJaskowska, JKowalski, PKazek, GSiwek, AWasik, AWesolowska, AMierzejewski, PBienkowski, P Novel arylsulfonamide derivatives with 5-HT6/5-HT7 receptor antagonism targeting behavioral and psychological symptoms of dementia. J Med Chem57:4543-57 (2014) 
 
D(2) dopamine receptor
Name:D(2) dopamine receptor
Type:Cell-surface receptors
Mol. Mass.:50647.10
Organism:Homo sapiens (Human)
Description:P14416
Residue:443
BDBM50008735
NameBDBM50008735
Synonyms:(+)-3-(tert-butyl)-(3S,4aS,13bS)-2,3,4,4a,8,9,13b,14-octahydro-1H-benzo[4,5]cyclohepta[de]pyrido[2,1-a]isoquinolin-3-ol (+/-)-3-(tert-butyl)-(3S,4aS,13bS)-2,3,4,4a,8,9,13b,14-octahydro-1H-benzo[4,5]cyclohepta[de]pyrido[2,1-a]isoquinolin-3-ol 3-(tert-butyl)-(3S,4aS,13bS)-2,3,4,4a,8,9,13b,14-octahydro-1H-benzo[4,5]cyclohepta[de]pyrido[2,1-a]isoquinolin-3-ol 3-(tert-butyl)-(3S,4aS,13bS)-2,3,4,4a,8,9,13b,14-octahydro-1H-benzo[4,5]cyclohepta[de]pyrido[2,1-a]isoquinolin-3-ol((+)-butaclamol) BUTACLAMOL BUTACLAMOL,(+) CHEMBL8514 | d-Butaclamol
TypeSmall organic molecule
Emp. Form.C25H31NO
Mol. Mass.361.5197
SMILESCC(C)(C)[C@]1(O)CCN2C[C@H]3c4ccccc4CCc4cccc([C@@H]2C1)c34