Reaction Details
TargetAlpha-1A adrenergic receptor
LigandBDBM50018019
Substrate/Competitorn/a
Meas. Tech.ChEMBL_1366829 (CHEMBL3297339)
Ki 0.800000±n/a nM
Citation Kolaczkowski, MMarcinkowska, MBucki, APawlowski, MMitka, KJaskowska, JKowalski, PKazek, GSiwek, AWasik, AWesolowska, AMierzejewski, PBienkowski, P Novel arylsulfonamide derivatives with 5-HT6/5-HT7 receptor antagonism targeting behavioral and psychological symptoms of dementia. J Med Chem57:4543-57 (2014) 
 
Alpha-1A adrenergic receptor
Name:Alpha-1A adrenergic receptor
Type:Cell-surface receptors
Mol. Mass.:51511.67
Organism:Homo sapiens (Human)
Description:P35348
Residue:466
BDBM50018019
NameBDBM50018019
Synonyms:CHEMBL3290012
TypeSmall organic molecule
Emp. Form.C24H26FN3O3S2
Mol. Mass.487.61
SMILESFc1ccc2c(noc2c1)C1CCN(CCCCNS(=O)(=O)c2cc3ccccc3s2)CC1