Reaction Details
Target5-hydroxytryptamine receptor 7
LigandBDBM50018251
Substrate/Competitorn/a
Meas. Tech.ChEMBL_1366807 (CHEMBL3297242)
Ki 0.700000±n/a nM
Citation Kolaczkowski, MMarcinkowska, MBucki, APawlowski, MMitka, KJaskowska, JKowalski, PKazek, GSiwek, AWasik, AWesolowska, AMierzejewski, PBienkowski, P Novel arylsulfonamide derivatives with 5-HT6/5-HT7 receptor antagonism targeting behavioral and psychological symptoms of dementia. J Med Chem57:4543-57 (2014) 
 
5-hydroxytryptamine receptor 7
Name:5-hydroxytryptamine receptor 7
Type:G Protein-Coupled Receptor (GPCR)
Mol. Mass.:53573.08
Organism:Homo sapiens (Human)
Description:P34969
Residue:479
BDBM50018251
NameBDBM50018251
Synonyms:CHEMBL3290017
TypeSmall organic molecule
Emp. Form.C25H27ClFN3O3S2
Mol. Mass.536.082
SMILESCc1c(sc2ccc(Cl)cc12)S(=O)(=O)NCCCCN1CCC(CC1)c1noc2cc(F)ccc12