Reaction Details
Target5-hydroxytryptamine receptor 2A
LigandBDBM50018035
Substrate/Competitorn/a
Meas. Tech.ChEMBL_1366808 (CHEMBL3297243)
Ki 8.1±n/a nM
Citation Kolaczkowski, MMarcinkowska, MBucki, APawlowski, MMitka, KJaskowska, JKowalski, PKazek, GSiwek, AWasik, AWesolowska, AMierzejewski, PBienkowski, P Novel arylsulfonamide derivatives with 5-HT6/5-HT7 receptor antagonism targeting behavioral and psychological symptoms of dementia. J Med Chem57:4543-57 (2014) 
 
5-hydroxytryptamine receptor 2A
Name:5-hydroxytryptamine receptor 2A
Type:undefined
Mol. Mass.:52607.65
Organism:Homo sapiens (Human)
Description:P28223
Residue:471
BDBM50018035
NameBDBM50018035
Synonyms:CHEMBL3289956
TypeSmall organic molecule
Emp. Form.C25H27ClN4O2S2
Mol. Mass.515.09
SMILESClc1ccc2cc(ccc2c1)S(=O)(=O)NCCCCN1CCN(CC1)c1nsc2ccccc12