Reaction Details
Target5-hydroxytryptamine receptor 2A
LigandBDBM50018242
Substrate/Competitorn/a
Meas. Tech.ChEMBL_1366808 (CHEMBL3297243)
Ki 3.1±n/a nM
Citation Kolaczkowski, MMarcinkowska, MBucki, APawlowski, MMitka, KJaskowska, JKowalski, PKazek, GSiwek, AWasik, AWesolowska, AMierzejewski, PBienkowski, P Novel arylsulfonamide derivatives with 5-HT6/5-HT7 receptor antagonism targeting behavioral and psychological symptoms of dementia. J Med Chem57:4543-57 (2014) 
 
5-hydroxytryptamine receptor 2A
Name:5-hydroxytryptamine receptor 2A
Type:undefined
Mol. Mass.:52607.65
Organism:Homo sapiens (Human)
Description:P28223
Residue:471
BDBM50018242
NameBDBM50018242
Synonyms:CHEMBL3290007
TypeSmall organic molecule
Emp. Form.C25H25ClFN3O3S
Mol. Mass.502.001
SMILESFc1ccc2c(noc2c1)C1CCN(CCCNS(=O)(=O)c2ccc3cc(Cl)ccc3c2)CC1