Reaction Details
Target5-hydroxytryptamine receptor 2A
LigandBDBM50018019
Substrate/Competitorn/a
Meas. Tech.ChEMBL_1366808 (CHEMBL3297243)
Ki 0.600000±n/a nM
Citation Kolaczkowski, MMarcinkowska, MBucki, APawlowski, MMitka, KJaskowska, JKowalski, PKazek, GSiwek, AWasik, AWesolowska, AMierzejewski, PBienkowski, P Novel arylsulfonamide derivatives with 5-HT6/5-HT7 receptor antagonism targeting behavioral and psychological symptoms of dementia. J Med Chem57:4543-57 (2014) 
 
5-hydroxytryptamine receptor 2A
Name:5-hydroxytryptamine receptor 2A
Type:undefined
Mol. Mass.:52607.65
Organism:Homo sapiens (Human)
Description:P28223
Residue:471
BDBM50018019
NameBDBM50018019
Synonyms:CHEMBL3290012
TypeSmall organic molecule
Emp. Form.C24H26FN3O3S2
Mol. Mass.487.61
SMILESFc1ccc2c(noc2c1)C1CCN(CCCCNS(=O)(=O)c2cc3ccccc3s2)CC1