Reaction Details
TargetSerine/threonine-protein kinase mTOR
LigandBDBM92862
Substrate/Competitorn/a
Meas. Tech.ChEMBL_1361073 (CHEMBL3291527)
IC50 5.0±n/a nM
Citation Seixas, JDLuengo-Arratta, SADiaz, RSaldivia, MRojas-Barros, DIManzano, PGonzalez, SBerlanga, MSmith, TKNavarro, MPollastri, MP Establishment of a structure-activity relationship of 1H-imidazo[4,5-c]quinoline-based kinase inhibitor NVP-BEZ235 as a lead for African sleeping sickness. J Med Chem57:4834-48 (2014) 
 
Serine/threonine-protein kinase mTOR
Name:Serine/threonine-protein kinase mTOR
Type:Rapamycin target protein
Mol. Mass.:288917.12
Organism:Homo sapiens (Human)
Description:P42345
Residue:2549
BDBM92862
NameBDBM92862
Synonyms:US9284315, BEZ-235 | mTOR Inhibitor, BEZ235
TypeSmall molecule
Emp. Form.C30H23N5O
Mol. Mass.469.5365
SMILESCn1c2cnc3ccc(cc3c2n(-c2ccc(cc2)C(C)(C)C#N)c1=O)-c1cnc2ccccc2c1