Reaction Details
TargetPhosphatidylinositol 4,5-bisphosphate 3-kinase catalytic subunit alpha isoform
LigandBDBM50018265
Substrate/Competitorn/a
Meas. Tech.ChEMBL_1361369 (CHEMBL3293768)
IC50 398±n/a nM
Citation Seixas, JDLuengo-Arratta, SADiaz, RSaldivia, MRojas-Barros, DIManzano, PGonzalez, SBerlanga, MSmith, TKNavarro, MPollastri, MP Establishment of a structure-activity relationship of 1H-imidazo[4,5-c]quinoline-based kinase inhibitor NVP-BEZ235 as a lead for African sleeping sickness. J Med Chem57:4834-48 (2014) 
 
Phosphatidylinositol 4,5-bisphosphate 3-kinase catalytic subunit alpha isoform
Name:Phosphatidylinositol 4,5-bisphosphate 3-kinase catalytic subunit alpha isoform
Type:Enzyme Subunit
Mol. Mass.:124294.87
Organism:Homo sapiens (Human)
Description:P42336
Residue:1068
BDBM50018265
NameBDBM50018265
Synonyms:CHEMBL3290293
TypeSmall organic molecule
Emp. Form.C25H22N6O
Mol. Mass.422.4818
SMILESCn1cc(cn1)-c1ccc2ncc3n(C)c(=O)n(-c4ccc(cc4)C(C)(C)C#N)c3c2c1