Reaction Details
TargetPhosphatidylinositol 4,5-bisphosphate 3-kinase catalytic subunit beta isoform
LigandBDBM50018267
Substrate/Competitorn/a
Meas. Tech.ChEMBL_1361370 (CHEMBL3293769)
IC50 31623±n/a nM
Citation Seixas, JDLuengo-Arratta, SADiaz, RSaldivia, MRojas-Barros, DIManzano, PGonzalez, SBerlanga, MSmith, TKNavarro, MPollastri, MP Establishment of a structure-activity relationship of 1H-imidazo[4,5-c]quinoline-based kinase inhibitor NVP-BEZ235 as a lead for African sleeping sickness. J Med Chem57:4834-48 (2014) 
 
Phosphatidylinositol 4,5-bisphosphate 3-kinase catalytic subunit beta isoform
Name:Phosphatidylinositol 4,5-bisphosphate 3-kinase catalytic subunit beta isoform
Type:Enzyme Subunit
Mol. Mass.:122769.00
Organism:Homo sapiens (Human)
Description:P42338
Residue:1070
BDBM50018267
NameBDBM50018267
Synonyms:CHEMBL3290305
TypeSmall organic molecule
Emp. Form.C23H18N4O
Mol. Mass.366.4152
SMILESCc1ccc(cc1)-n1c2c(cnc3ccc(cc23)-c2ccncc2)n(C)c1=O