Reaction Details
TargetPhosphatidylinositol 4,5-bisphosphate 3-kinase catalytic subunit gamma isoform
LigandBDBM50018266
Substrate/Competitorn/a
Meas. Tech.ChEMBL_1361371 (CHEMBL3293770)
IC50 1995±n/a nM
Citation Seixas, JDLuengo-Arratta, SADiaz, RSaldivia, MRojas-Barros, DIManzano, PGonzalez, SBerlanga, MSmith, TKNavarro, MPollastri, MP Establishment of a structure-activity relationship of 1H-imidazo[4,5-c]quinoline-based kinase inhibitor NVP-BEZ235 as a lead for African sleeping sickness. J Med Chem57:4834-48 (2014) 
 
Phosphatidylinositol 4,5-bisphosphate 3-kinase catalytic subunit gamma isoform
Name:Phosphatidylinositol 4,5-bisphosphate 3-kinase catalytic subunit gamma isoform
Type:Enzyme Subunit
Mol. Mass.:126470.30
Organism:Homo sapiens (Human)
Description:P48736
Residue:1102
BDBM50018266
NameBDBM50018266
Synonyms:CHEMBL3290300
TypeSmall organic molecule
Emp. Form.C21H18N4O
Mol. Mass.342.3938
SMILESCn1c2cnc3ccccc3c2n(-c2ccc(cc2)C(C)(C)C#N)c1=O