Reaction Details
TargetE3 ubiquitin-protein ligase Mdm2
LigandBDBM50229787
Substrate/Competitorn/a
Meas. Tech.ChEMBL_1362099 (CHEMBL3294652)
Ki 90±n/a nM
Citation Li, JWu, YGuo, ZZhuang, CYao, JDong, GYu, ZMin, XWang, SLiu, YWu, SZhu, SSheng, CMiao, ZZhang, W Discovery of 1-arylpyrrolidone derivatives as potent p53-MDM2 inhibitors based on molecule fusing strategy. Bioorg Med Chem Lett24:2648-50 (2014) 
 
E3 ubiquitin-protein ligase Mdm2
Name:E3 ubiquitin-protein ligase Mdm2
Type:Oncoprotein
Mol. Mass.:55196.54
Organism:Homo sapiens (Human)
Description:Q00987
Residue:491
BDBM50229787
NameBDBM50229787
Synonyms:(4S,5R)-Nutlin-3 4-((4S,5R)-4,5-bis(4-chlorophenyl)-2-(2-isopropoxy-4-methoxyphenyl)-4,5-dihydro-1H-imidazole-1-carbonyl)piperazin-2-one 4-[(4S,5R)-4,5-Bis-(4-chloro-phenyl)-2-(2-isopropoxy-4-methoxy-phenyl)-4,5-dihydro-imidazole-1-carbonyl]-piperazin-2-one NUTLIN-3 rac-4-(4,5-bis(4-chlorophenyl)-2-(2-isopropoxy-4-methoxyphenyl)-4,5-dihydro-1H-imidazole-1-carbonyl)piperazin-2-one
TypeSmall organic molecule
Emp. Form.C30H30Cl2N4O4
Mol. Mass.581.49
SMILESCOc1ccc(C2=N[C@H]([C@H](N2C(=O)N2CCNC(=O)C2)c2ccc(Cl)cc2)c2ccc(Cl)cc2)c(OC(C)C)c1