Reaction Details
TargetE3 ubiquitin-protein ligase Mdm2
LigandBDBM50018542
Substrate/Competitorn/a
Meas. Tech.ChEMBL_1362099 (CHEMBL3294652)
Ki 8180±n/a nM
Citation Li, JWu, YGuo, ZZhuang, CYao, JDong, GYu, ZMin, XWang, SLiu, YWu, SZhu, SSheng, CMiao, ZZhang, W Discovery of 1-arylpyrrolidone derivatives as potent p53-MDM2 inhibitors based on molecule fusing strategy. Bioorg Med Chem Lett24:2648-50 (2014) 
 
E3 ubiquitin-protein ligase Mdm2
Name:E3 ubiquitin-protein ligase Mdm2
Type:Oncoprotein
Mol. Mass.:55196.54
Organism:Homo sapiens (Human)
Description:Q00987
Residue:491
BDBM50018542
NameBDBM50018542
Synonyms:CHEMBL3290676
TypeSmall organic molecule
Emp. Form.C37H34BrF3N2O3
Mol. Mass.691.577
SMILESC[C@@H](NC1=C(C(N(Cc2ccc(cc2OC(C)(C)C)C(F)(F)F)C1=O)c1ccc(Br)cc1)C(=O)c1ccccc1)c1ccccc1