Reaction Details
TargetBeta-2 adrenergic receptor
LigandBDBM86453
Substrate/Competitorn/a
Meas. Tech.ChEMBL_1362118 (CHEMBL3294890)
Ki 32±n/a nM
Citation Jacobsen, JRAggen, JBChurch, TJKlein, UPfeiffer, JWPulido-Rios, TMThomas, GRYu, CMoran, EJ Multivalent design of long-actingß(2)-adrenoceptor agonists incorporating biarylamines. Bioorg Med Chem Lett24:2625-30 (2014) 
 
Beta-2 adrenergic receptor
Name:Beta-2 adrenergic receptor
Type:n/a
Mol. Mass.:46461.69
Organism:Homo sapiens (Human)
Description:P07550
Residue:413
BDBM86453
NameBDBM86453
Synonyms:CAS_73573-87-2 NSC_3083544
TypeSmall organic molecule
Emp. Form.C19H24N2O4
Mol. Mass.344.4049
SMILESCOc1ccc(CC(C)NCC(O)c2ccc(O)c(NC=O)c2)cc1