Reaction Details
TargetBeta-2 adrenergic receptor
LigandBDBM50018599
Substrate/Competitorn/a
Meas. Tech.ChEMBL_1362118 (CHEMBL3294890)
Ki<10000±n/a nM
Citation Jacobsen, JRAggen, JBChurch, TJKlein, UPfeiffer, JWPulido-Rios, TMThomas, GRYu, CMoran, EJ Multivalent design of long-actingß(2)-adrenoceptor agonists incorporating biarylamines. Bioorg Med Chem Lett24:2625-30 (2014) 
 
Beta-2 adrenergic receptor
Name:Beta-2 adrenergic receptor
Type:n/a
Mol. Mass.:46461.69
Organism:Homo sapiens (Human)
Description:P07550
Residue:413
BDBM50018599
NameBDBM50018599
Synonyms:CHEMBL3290980
TypeSmall organic molecule
Emp. Form.C23H31N3O4
Mol. Mass.413.5099
SMILESCC(=O)N1CCN(CC1)c1ccc(CCNCC(O)c2ccc(O)c(CO)c2)cc1