Reaction Details
TargetBeta-1 adrenergic receptor
LigandBDBM50018604
Substrate/Competitorn/a
Meas. Tech.ChEMBL_1362119 (CHEMBL3294891)
Ki 31623±n/a nM
Citation Jacobsen, JRAggen, JBChurch, TJKlein, UPfeiffer, JWPulido-Rios, TMThomas, GRYu, CMoran, EJ Multivalent design of long-actingß(2)-adrenoceptor agonists incorporating biarylamines. Bioorg Med Chem Lett24:2625-30 (2014) 
 
Beta-1 adrenergic receptor
Name:Beta-1 adrenergic receptor
Type:G Protein-Coupled Receptor (GPCR)
Mol. Mass.:51338.40
Organism:Homo sapiens (Human)
Description:P08588
Residue:477
BDBM50018604
NameBDBM50018604
Synonyms:CHEMBL3290985
TypeSmall organic molecule
Emp. Form.C27H28N2O3
Mol. Mass.428.5228
SMILESOCc1cc(ccc1O)C(O)CNCCc1ccc(Nc2cccc3ccccc23)cc1