Reaction Details
TargetBeta-1 adrenergic receptor
LigandBDBM50018609
Substrate/Competitorn/a
Meas. Tech.ChEMBL_1362119 (CHEMBL3294891)
Ki 12589±n/a nM
Citation Jacobsen, JRAggen, JBChurch, TJKlein, UPfeiffer, JWPulido-Rios, TMThomas, GRYu, CMoran, EJ Multivalent design of long-actingß(2)-adrenoceptor agonists incorporating biarylamines. Bioorg Med Chem Lett24:2625-30 (2014) 
 
Beta-1 adrenergic receptor
Name:Beta-1 adrenergic receptor
Type:G Protein-Coupled Receptor (GPCR)
Mol. Mass.:51338.40
Organism:Homo sapiens (Human)
Description:P08588
Residue:477
BDBM50018609
NameBDBM50018609
Synonyms:CHEMBL3290990
TypeSmall organic molecule
Emp. Form.C24H28N2O4
Mol. Mass.408.4901
SMILESCOc1cccc(Nc2ccc(CCNCC(O)c3ccc(O)c(CO)c3)cc2)c1